Target
Histone deacetylase 1
Ligand
BDBM187219
Substrate
Meas. Tech.
HDAC1 Assay
IC50
4100±n/a nM
Citation
 Hebach, CKallen, JNozulak, JTintelnot-Blomley, MWidler, L Trifluoromethyl-oxadiazole derivatives and their use in the treatment of disease US Patent  US9670193 Publication Date 6/6/2017 
Target
Name:
Histone deacetylase 1
Synonyms:
Cereblon/Histone deacetylase 1 HDAC1 Histone deacetylase 1 (HDAC1) RPD3L1
Type:
Enzyme
Mol. Mass.:
55090.27
Organism:
Homo sapiens (Human)
Description:
Q13547
Residue:
482
  
Inhibitor
Name:
BDBM187219
Synonyms:
US9670193, 9 N-(1-(pyridin-4-yl)ethyl)-5-(5-(trifluoromethyl)-1,2,4-oxadiazol-3-yl)pyrimidin-2-amine
Type:
Small organic molecule
Emp. Form.:
C14H11F3N6O
Mol. Mass.:
336.2719
SMILES:
CC(Nc1ncc(cn1)-c1noc(n1)C(F)(F)F)c1ccncc1
: