Target
Histone deacetylase 4 [2-1084]
Ligand
BDBM187220
Substrate
Meas. Tech.
HDAC4 Assay
pH
8±n/a
Temperature
298.15±n/a K
IC50
140±n/a nM
Comments
extracted
Citation
 Hebach, CKallen, JNozulak, JTintelnot-Blomley, MWidler, L Trifluoromethyl-oxadiazole derivatives and their use in the treatment of disease US Patent  US9670193 Publication Date 6/6/2017 
Target
Name:
Histone deacetylase 4 [2-1084]
Synonyms:
HDAC4 (aa 2-1084) HDAC4_HUMAN | KIAA0288
Type:
Mol. Mass.:
118831.12
Organism:
Homo sapiens (Human)
Description:
P56524[2-1084]
Residue:
1082
  
Inhibitor
Name:
BDBM187220
Synonyms:
US9670193, 10 N-(pyridin-3-ylmethyl)-5-(5-(trifluoromethyl)-1,2,4-oxadiazol-3-yl)pyrimidin-2-amine
Type:
Small organic molecule
Emp. Form.:
C13H9F3N6O
Mol. Mass.:
322.2454
SMILES:
FC(F)(F)c1nc(no1)-c1cnc(NCc2cccnc2)nc1
: