Target
Histone deacetylase 6
Ligand
BDBM187246
Substrate
Meas. Tech.
HDAC6 Assay
IC50
>10000±n/a nM
Citation
 Hebach, CKallen, JNozulak, JTintelnot-Blomley, MWidler, L Trifluoromethyl-oxadiazole derivatives and their use in the treatment of disease US Patent  US9670193 Publication Date 6/6/2017 
Target
Name:
Histone deacetylase 6
Synonyms:
Cereblon/Histone deacetylase 6 HDAC6 Histone deacetylase 6 (HDAC6) KIAA0901 | ORF Names:JM21
Type:
Chromatin regulator; hydrolase; repressor
Mol. Mass.:
131381.51
Organism:
Homo sapiens (Human)
Description:
Q9UBN7
Residue:
1215
  
Inhibitor
Name:
BDBM187246
Synonyms:
US9670193, 18 (R)?N-(1-(dimethylamino)propan-2-yl)-6-(5-(trifluoromethyl)-1,2,4-oxadiazol-3-yl)nicotinamide
Type:
Small organic molecule
Emp. Form.:
C14H16F3N5O2
Mol. Mass.:
343.3043
SMILES:
C[C@H](CN(C)C)NC(=O)c1ccc(nc1)-c1noc(n1)C(F)(F)F
: