Target
Histone deacetylase 6
Ligand
BDBM187802
Substrate
Meas. Tech.
HDAC6 Assay
IC50
2000±n/a nM
Citation
 Hebach, CKallen, JNozulak, JTintelnot-Blomley, MWidler, L Trifluoromethyl-oxadiazole derivatives and their use in the treatment of disease US Patent  US9670193 Publication Date 6/6/2017 
Target
Name:
Histone deacetylase 6
Synonyms:
Cereblon/Histone deacetylase 6 HDAC6 Histone deacetylase 6 (HDAC6) KIAA0901 | ORF Names:JM21
Type:
Chromatin regulator; hydrolase; repressor
Mol. Mass.:
131381.51
Organism:
Homo sapiens (Human)
Description:
Q9UBN7
Residue:
1215
  
Inhibitor
Name:
BDBM187802
Synonyms:
US9670193, 37 3-chloro-N-(pyridin-3-ylmethyl)-5-(5-(trifluoromethyl)-1,2,4-oxadiazol-3-yl)pyridin-2-amine
Type:
Small organic molecule
Emp. Form.:
C14H9ClF3N5O
Mol. Mass.:
355.702
SMILES:
FC(F)(F)c1nc(no1)-c1cnc(NCc2cccnc2)c(Cl)c1
: