Target
D(2) dopamine receptor
Ligand
BDBM319733
Substrate
Meas. Tech.
D2 Receptor Antagonism Activity Test
IC50
5.97±n/a nM
Citation
 Jiang, HWang, ZLi, JZhang, RHe, YLiu, YBi, MLiu, ZTian, GChen, WYang, FWu, CWang, YJiang, XYin, JWang, GShen, J Heterocyclic compounds, process for preparation of the same and use thereof US Patent  US10174011 Publication Date 1/8/2019 
Target
Name:
D(2) dopamine receptor
Synonyms:
D(2) dopamine receptor DOPAMINE D2 Long DRD2 Dopamine D2 receptor Dopamine D2 receptor (D2R) Dopamine2-like | d2
Type:
Cell-surface receptors
Mol. Mass.:
50647.10
Organism:
Homo sapiens (Human)
Description:
P14416
Residue:
443
  
Inhibitor
Name:
BDBM319733
Synonyms:
5-(2-(4-(benzo[b]thiophen-4-yl)piperazin-1-yl)ethyl)benzo[d]thiazol-2-amine | US10174011, Example 116
Type:
Small organic molecule
Emp. Form.:
C21H22N4S2
Mol. Mass.:
394.556
SMILES:
Nc1nc2cc(CCN3CCN(CC3)c3cccc4sccc34)ccc2s1
: