Target
D(2) dopamine receptor
Ligand
BDBM319621
Substrate
Meas. Tech.
D2 Receptor Agonism Activity Test
IC50
2.23±n/a nM
Citation
 Jiang, HWang, ZLi, JZhang, RHe, YLiu, YBi, MLiu, ZTian, GChen, WYang, FWu, CWang, YJiang, XYin, JWang, GShen, J Heterocyclic compounds, process for preparation of the same and use thereof US Patent  US10174011 Publication Date 1/8/2019 
Target
Name:
D(2) dopamine receptor
Synonyms:
D(2) dopamine receptor DOPAMINE D2 Long DRD2 Dopamine D2 receptor Dopamine D2 receptor (D2R) Dopamine2-like | d2
Type:
Cell-surface receptors
Mol. Mass.:
50647.10
Organism:
Homo sapiens (Human)
Description:
P14416
Residue:
443
  
Inhibitor
Name:
BDBM319621
Synonyms:
7-(2-(4-(benzo[b]thiophen-4-yl)piperazin-1-yl)ethyl)-3,4-dihydroquinolin-2(1H)-one | US10174011, Example 19
Type:
Small organic molecule
Emp. Form.:
C23H25N3OS
Mol. Mass.:
391.529
SMILES:
O=C1CCc2ccc(CCN3CCN(CC3)c3cccc4sccc34)cc2N1
: