Target
D(2) dopamine receptor
Ligand
BDBM50130293
Substrate
Meas. Tech.
D2 Receptor Agonism Activity Test
IC50
10.1±n/a nM
Citation
 Jiang, HWang, ZLi, JZhang, RHe, YLiu, YBi, MLiu, ZTian, GChen, WYang, FWu, CWang, YJiang, XYin, JWang, GShen, J Heterocyclic compounds, process for preparation of the same and use thereof US Patent  US10174011 Publication Date 1/8/2019 
Target
Name:
D(2) dopamine receptor
Synonyms:
D(2) dopamine receptor DOPAMINE D2 Long DRD2 Dopamine D2 receptor Dopamine D2 receptor (D2R) Dopamine2-like | d2
Type:
Cell-surface receptors
Mol. Mass.:
50647.10
Organism:
Homo sapiens (Human)
Description:
P14416
Residue:
443
  
Inhibitor
Name:
BDBM50130293
Synonyms:
7-{4-[4-(2,3-dichlorophenyl)piperazin-1-yl]butoxy}-3,4-dihydroquinolin-2(1H)-one CHEMBL1112 US10752588, Compound Aripiprazole US9018213, aripprazole | US9156822, Aripiprazole
Type:
Small organic molecule
Emp. Form.:
C23H27Cl2N3O2
Mol. Mass.:
448.385
SMILES:
Clc1cccc(N2CCN(CCCCOc3ccc4CCC(=O)Nc4c3)CC2)c1Cl
: