Target
Potassium voltage-gated channel subfamily H member 2
Ligand
BDBM319759
Substrate
Meas. Tech.
Determination of a Possible Activity on hERG
IC50
2500±n/a nM
Citation
 Czardybon, WBrzózka, KGalezowski, MWindak, RMilik, MZawadzka, MGuzik, PWincza, EProkop, MWiklik, KSabiniarz, ACholody, WMHorvath, RRzymski, T Benzimidazole derivatives as kinase inhibitors US Patent  US10174013 Publication Date 1/8/2019 
Target
Name:
Potassium voltage-gated channel subfamily H member 2
Synonyms:
1,3-beta-glucan synthase component GLS2 ERG Eag-related protein 1 Ether-a-go-go-related gene (HERG) Ether-a-go-go-related gene potassium channel 1 Ether-a-go-go-related gene potassium channel 1 (hERG1) Ether-a-go-go-related protein 1 H-ERG KCNH2 Potassium voltage-gated channel subfamily H member 2 (hERG) Voltage-gated potassium channel subunit Kv11.1 hERG Potassium Channel 1 | putative potassium channel subunit
Type:
Multi-pass membrane protein
Mol. Mass.:
126672.65
Organism:
Homo sapiens (Human)
Description:
Q12809
Residue:
1159
  
Inhibitor
Name:
BDBM319759
Synonyms:
US10174013, Example 2A US10174013, Example 2D
Type:
Small organic molecule
Emp. Form.:
C16H19Br2N5O4
Mol. Mass.:
505.161
SMILES:
CC(C)(C)OC(=O)N1CCN(CC1)c1nc2c(c(Br)c(Br)cc2[nH]1)[N+]([O-])=O
: