Target
Receptor-type tyrosine-protein kinase FLT3 [D835Y]
Ligand
BDBM319752
Substrate
Meas. Tech.
FLT3 Kinase assay
Kd
46±0.0 nM
Citation
 Czardybon, WBrzózka, KGalezowski, MWindak, RMilik, MZawadzka, MGuzik, PWincza, EProkop, MWiklik, KSabiniarz, ACholody, WMHorvath, RRzymski, T Benzimidazole derivatives as kinase inhibitors US Patent  US10174013 Publication Date 1/8/2019 
Target
Name:
Receptor-type tyrosine-protein kinase FLT3 [D835Y]
Synonyms:
CD135 FLK2 FLT3(D835Y) Receptor-type tyrosine-protein kinase FLT3 (D835Y) STK1 Tyrosine Kinase FLT3 Mutant (D835Y)
Type:
Mol. Mass.:
112937.71
Organism:
Homo sapiens (Human)
Description:
P36888 D835Y
Residue:
993
  
Inhibitor
Name:
BDBM319752
Synonyms:
US10174013, Example 1A US10174013, Example 1Y
Type:
Small organic molecule
Emp. Form.:
C13H15Br2N5O2
Mol. Mass.:
433.099
SMILES:
CCn1c(nc2c(c(Br)c(Br)cc12)[N+]([O-])=O)N1CCNCC1
: