Target
Receptor-type tyrosine-protein kinase FLT3
Ligand
BDBM319787
Substrate
Meas. Tech.
FLT3 Kinase assay
Kd
18±0.0 nM
Citation
 Czardybon, WBrzózka, KGalezowski, MWindak, RMilik, MZawadzka, MGuzik, PWincza, EProkop, MWiklik, KSabiniarz, ACholody, WMHorvath, RRzymski, T Benzimidazole derivatives as kinase inhibitors US Patent  US10174013 Publication Date 1/8/2019 
Target
Name:
Receptor-type tyrosine-protein kinase FLT3
Synonyms:
CD135 FL cytokine receptor FLK2 FLT3 Fetal liver kinase-2 Fms-like tyrosine kinase 3 (Flt-3) STK-1 Stem cell tyrosine kinase 1
Type:
Enzyme
Mol. Mass.:
112888.62
Organism:
Homo sapiens (Human)
Description:
P36888
Residue:
993
  
Inhibitor
Name:
BDBM319787
Synonyms:
5,6-dibromo-4-nitro-2-(piperazin-1-yl)-1-(propan-2-yl)-1H-1,3-benzodiazole | US10174013, Example 2A
Type:
Small organic molecule
Emp. Form.:
C14H17Br2N5O2
Mol. Mass.:
447.125
SMILES:
CC(C)n1c(nc2c(c(Br)c(Br)cc12)[N+]([O-])=O)N1CCNCC1
: