Target
Fatty-acid amide hydrolase 1
Ligand
BDBM319821
Substrate
Meas. Tech.
Determining Endocannabinoid Hydrolase Activity
IC50
>100000±n/a nM
Citation
 Liu, ZQiu, YRen, JLi, YYang, LZhu, C Substituted heterocyclic derivative, preparation method and use thereof US Patent  US10174015 Publication Date 1/8/2019 
Target
Name:
Fatty-acid amide hydrolase 1
Synonyms:
Anandamide amidohydrolase FAAH FAAH1_HUMAN Fatty-acid amide hydrolase (FAAH) Oleamide hydrolase 1
Type:
Protein
Mol. Mass.:
63071.19
Organism:
Homo sapiens (Human)
Description:
O00519
Residue:
579
  
Inhibitor
Name:
BDBM319821
Synonyms:
US10174015, Compound 34
Type:
Small organic molecule
Emp. Form.:
C14H24N2O3
Mol. Mass.:
268.352
SMILES:
O=C(CCCCCC1CCCNC1)N1CCOC1=O
: