Target
P2X purinoceptor 2
Ligand
BDBM319898
Substrate
Meas. Tech.
Intracellular Calcium Measurement to Assess Antagonist Activity at Human P2X3 and Human P2X2/3 Receptors
IC50
54.0±n/a nM
Citation
 Davenport, AJBräuer, NFischer, OMRotgeri, ARottmann, ANeagoe, INagel, JGodinho-Coelho, AKlar, J 1,3-thiazol-2-yl substituted benzamides US Patent  US10174016 Publication Date 1/8/2019 
Target
Name:
P2X purinoceptor 2
Synonyms:
ATP receptor P2RX2_HUMAN Purinergic receptor | PurinergicP2X2/3
Type:
Enzyme Catalytic Domain
Mol. Mass.:
51765.18
Organism:
Homo sapiens (Human)
Description:
PurinergicP2X2/3 0 HUMAN::Q9UBL9
Residue:
471
  
Inhibitor
Name:
BDBM319898
Synonyms:
N-[1-(5- Chloro-3- fluoropyridin- 2-yl)ethyl]-3- (5-methyL- 1,3-thiazol-2- yl)-5-[(3S)- tetrahydrofuran- 3-ylmethoxy] benzamide US10202369, Example 65 | US10472354, Example 65
Type:
Small organic molecule
Emp. Form.:
C23H23ClFN3O3S
Mol. Mass.:
475.963
SMILES:
CC(NC(=O)c1cc(OC[C@H]2CCOC2)cc(c1)-c1ncc(C)s1)c1ncc(Cl)cc1F
: