Target
P2X purinoceptor 2
Ligand
BDBM320017
Substrate
Meas. Tech.
Intracellular Calcium Measurement to Assess Antagonist Activity at Human P2X3 and Human P2X2/3 Receptors
IC50
128±n/a nM
Citation
 Davenport, AJBräuer, NFischer, OMRotgeri, ARottmann, ANeagoe, INagel, JGodinho-Coelho, AKlar, J 1,3-thiazol-2-yl substituted benzamides US Patent  US10174016 Publication Date 1/8/2019 
Target
Name:
P2X purinoceptor 2
Synonyms:
ATP receptor P2RX2_HUMAN Purinergic receptor | PurinergicP2X2/3
Type:
Enzyme Catalytic Domain
Mol. Mass.:
51765.18
Organism:
Homo sapiens (Human)
Description:
PurinergicP2X2/3 0 HUMAN::Q9UBL9
Residue:
471
  
Inhibitor
Name:
BDBM320017
Synonyms:
Trans Isomer 1; 3- (5-chloro-1,3- thiazol-2-yl)-5-{[3- hydroxybutan-2- yl]oxy}-N-{(1R)-1- [2-(trifluoromethyl) pyrimidin-5-yl]ethyl} benzamide US10174016, Example 185 US10174016, Example 188 US10472354, Example 188
Type:
Small organic molecule
Emp. Form.:
C21H20ClF3N4O3S
Mol. Mass.:
500.922
SMILES:
CC(O)C(C)Oc1cc(cc(c1)-c1ncc(Cl)s1)C(=O)N[C@H](C)c1cnc(nc1)C(F)(F)F
: