Target
Cytochrome P450 2C8
Ligand
BDBM319881
Substrate
Meas. Tech.
CYP Inhibition and Pre-Incubation CYP Inhibition Assays
IC50
>20000±n/a nM
Citation
 Davenport, AJBräuer, NFischer, OMRotgeri, ARottmann, ANeagoe, INagel, JGodinho-Coelho, AKlar, J 1,3-thiazol-2-yl substituted benzamides US Patent  US10174016 Publication Date 1/8/2019 
Target
Name:
Cytochrome P450 2C8
Synonyms:
CP2C8_HUMAN CYPIIC8 P450 IIC2 P450 form 1 | S-mephenytoin 4-hydroxylase
Type:
Protein
Mol. Mass.:
55839.23
Organism:
Homo sapiens (Human)
Description:
P10632
Residue:
490
  
Inhibitor
Name:
BDBM319881
Synonyms:
3-(5-Methyl-1,3-thiazol-2-yl)-5-(oxetan-3-yloxy)-N-{(1R)-1-[2-(trifluoromethyl)pyrimidin-5-yl]ethyl}benzamide US10202369, Example 48 | US10472354, Example 48
Type:
Small organic molecule
Emp. Form.:
C21H19F3N4O3S
Mol. Mass.:
464.461
SMILES:
C[C@@H](NC(=O)c1cc(OC2COC2)cc(c1)-c1ncc(C)s1)c1cnc(nc1)C(F)(F)F
: