Target
Poly [ADP-ribose] polymerase 1
Ligand
BDBM320272
Substrate
Meas. Tech.
HT Universal Chemiluminescent PARP Assay Kit
IC50
5.00±n/a nM
Citation
 Fan, XQin, J Heterocyclic-imidazole compounds, pharmaceutical compositions thereof, preparation method therefor and use thereof US Patent  US10174023 Publication Date 1/8/2019 
Target
Name:
Poly [ADP-ribose] polymerase 1
Synonyms:
(ARTD1 or PARP1) 2.4.2.30 ADPRT ARTD1 Human diphtheria toxin-like ADP-ribosyltransferase (ARTD1 or PARP1) NT-PARP-1 PARP1 PPOL Poly [ADP-ribose] polymerase 1 (PARP) Poly [ADP-ribose] polymerase 1 (PARP1) Poly [ADP-ribose] polymerase 1, 28-kDa form Poly [ADP-ribose] polymerase 1, processed C-terminus Poly [ADP-ribose] polymerase-1 Poly(ADP-ribose) polymerase-1 (ARTD1/PARP1) Protein poly-ADP-ribosyltransferase PARP1 | Synonyms=ADPRT
Type:
Mol. Mass.:
113114.22
Organism:
Homo sapiens (Human)
Description:
P09874
Residue:
1014
  
Inhibitor
Name:
BDBM320272
Synonyms:
4-(3-(4-(1H-[1,2,3]triazolo[4,5-b]pyridin-5-yl)piperazine-1-carbonyl)-benzyl)phthalazin-1 (2H)-one | US10174023, Compound (10)
Type:
Small organic molecule
Emp. Form.:
C25H22N8O2
Mol. Mass.:
466.4946
SMILES:
O=C(N1CCN(CC1)c1ccc2[nH]nnc2n1)c1cccc(Cc2n[nH]c(=O)c3ccccc23)c1
: