Target
Bromodomain-containing protein 4
Ligand
BDBM320349
Substrate
Meas. Tech.
Time Resolved Fluorescence Resonance Energy Transfer (TR-FRET) Assay
IC50
<5±n/a nM
Citation
 Han, WDegnan, APDeskus, JAGavai, AVGill, PSchmitz, WDStarrett, Jr., JE 5H-pyrido[3,2-B]indole compounds as anticancer agents US Patent  US10174024 Publication Date 1/8/2019 
Target
Name:
Bromodomain-containing protein 4
Synonyms:
BRD4 Bromodomain-containing protein 4 (BRD4) Protein HUNK1
Type:
Protein
Mol. Mass.:
152264.84
Organism:
Homo sapiens (Human)
Description:
O60885
Residue:
1362
  
Inhibitor
Name:
BDBM320349
Synonyms:
4-{5-[(3-Fluoropyridin-2-yl)(oxan-4-yl)methyl]-3-[4-(2H3)methyl-1-methyl-1H-1,2,3-triazol-5-yl]-5H-pyrido[3,2-b]indol-7-yl}-1λ6,4-thiomorpholine-1,1-dione US10174024, Example 68
Type:
Small organic molecule
Emp. Form.:
C30H33FN7O3S
Mol. Mass.:
590.692
SMILES:
Cc1n[nH]n(C)c1-c1cnc2c(c1)n(C(C1CCOCC1)c1ncccc1F)c1cc(ccc21)N1CCS(=O)(=O)CC1
: