Target
Bromodomain-containing protein 4
Ligand
BDBM320355
Substrate
Meas. Tech.
Time Resolved Fluorescence Resonance Energy Transfer (TR-FRET) Assay
IC50
<1500±n/a nM
Citation
 Han, WDegnan, APDeskus, JAGavai, AVGill, PSchmitz, WDStarrett, Jr., JE 5H-pyrido[3,2-B]indole compounds as anticancer agents US Patent  US10174024 Publication Date 1/8/2019 
Target
Name:
Bromodomain-containing protein 4
Synonyms:
BRD4 Bromodomain-containing protein 4 (BRD4) Protein HUNK1
Type:
Protein
Mol. Mass.:
152264.84
Organism:
Homo sapiens (Human)
Description:
O60885
Residue:
1362
  
Inhibitor
Name:
BDBM320355
Synonyms:
1-{5-[(4,4-Difluorocyclohexyl)(phenyl)methyl]-6-methanesulfonyl-3-[4-(2H3)methyl-1-methyl-1H-1,2,3-triazol-5-yl]-5H-pyrido[3,2-b]indol-9-yl}-4,4-difluoropiperidine US10174024, Example 74
Type:
Small organic molecule
Emp. Form.:
C34H37F4N6
Mol. Mass.:
605.6914
SMILES:
Cc1[nH]nn(C)c1-c1cnc2c(c1)n(C(C1CCC(F)(F)CC1)c1ccccc1)c1c(C)ccc(N3CCC(F)(F)CC3)c21
: