Target
Bromodomain-containing protein 4
Ligand
BDBM320359
Substrate
Meas. Tech.
Time Resolved Fluorescence Resonance Energy Transfer (TR-FRET) Assay
IC50
<1±n/a nM
Citation
 Han, WDegnan, APDeskus, JAGavai, AVGill, PSchmitz, WDStarrett, Jr., JE 5H-pyrido[3,2-B]indole compounds as anticancer agents US Patent  US10174024 Publication Date 1/8/2019 
Target
Name:
Bromodomain-containing protein 4
Synonyms:
BRD4 Bromodomain-containing protein 4 (BRD4) Protein HUNK1
Type:
Protein
Mol. Mass.:
152264.84
Organism:
Homo sapiens (Human)
Description:
O60885
Residue:
1362
  
Inhibitor
Name:
BDBM320359
Synonyms:
1-{5-[(4,4-Difluorocyclohexyl)(phenyl)methyl]-3-(dimethyl-1H-1,2,3-triazol-5-yl)-5H-pyrido[3,2-b]indol-7-yl}-4-(trifluoromethyl)piperidine US10174024, Example 78
Type:
Small organic molecule
Emp. Form.:
C34H36F5N6
Mol. Mass.:
623.6819
SMILES:
Cc1n[nH]n(C)c1-c1cnc2c(c1)n(C(C1CCC(F)(F)CC1)c1ccccc1)c1cc(ccc21)N1CCC(CC1)C(F)(F)F
: