Target
Lysine-specific histone demethylase 1A
Ligand
BDBM194689
Substrate
Meas. Tech.
LSD1 Histone Demethylase Biochemical Assay
IC50
<100±n/a nM
Citation
 Wu, LHe, CWang, XCourter, JRZhang, FYao, W Cyclopropylamines as LSD1 inhibitors US Patent  US10174030 Publication Date 1/8/2019 
Target
Name:
Lysine-specific histone demethylase 1A
Synonyms:
AOF2 Flavin-containing amine oxidase domain-containing protein 2 KDM1A KIAA0601 Lysine-specific demethylase 1 (LSD1) Lysine-specific histone demethylase 1 (LSD1)
Type:
Enzyme
Mol. Mass.:
92901.01
Organism:
Homo sapiens (Human)
Description:
O60341
Residue:
852
  
Inhibitor
Name:
BDBM194689
Synonyms:
US10174030, Example 75 US11247992, Example 75 | US9670210, Example 75 1-{[4-[(2-fluorophenoxy)methyl]-4-({[(1R,2S)-2-phenylcyclopropyl]amino}methyl)piperidin-1-yl]methyl}cyclopropanecarboxylic acid
Type:
Small organic molecule
Emp. Form.:
C27H33FN2O3
Mol. Mass.:
452.5609
SMILES:
OC(=O)C1(CN2CCC(CN[C@@H]3CC3c3ccccc3)(COc3ccccc3F)CC2)CC1
: