Target
Lysine-specific histone demethylase 1A
Ligand
BDBM194716
Substrate
Meas. Tech.
LSD1 Histone Demethylase Biochemical Assay
IC50
<100±n/a nM
Citation
 Wu, LHe, CWang, XCourter, JRZhang, FYao, W Cyclopropylamines as LSD1 inhibitors US Patent  US10174030 Publication Date 1/8/2019 
Target
Name:
Lysine-specific histone demethylase 1A
Synonyms:
AOF2 Flavin-containing amine oxidase domain-containing protein 2 KDM1A KIAA0601 Lysine-specific demethylase 1 (LSD1) Lysine-specific histone demethylase 1 (LSD1)
Type:
Enzyme
Mol. Mass.:
92901.01
Organism:
Homo sapiens (Human)
Description:
O60341
Residue:
852
  
Inhibitor
Name:
BDBM194716
Synonyms:
US10174030, Example 102 US11247992, Example 102 | US9670210, Example 102 1-{[4-(methoxymethyl)-4-({[(1R,2S)-2-phenylcyclopropyl]amino}methyl)piperidin-1-yl]carbonyl}cyclopropanecarbonitrile
Type:
Small organic molecule
Emp. Form.:
C22H29N3O2
Mol. Mass.:
367.4846
SMILES:
COCC1(CN[C@@H]2CC2c2ccccc2)CCN(CC1)C(=O)C1(CC1)C#N
: