Target
Replicase polyprotein 1ab
Ligand
BDBM11271
Substrate
fluorogenic substrate peptide
Meas. Tech.
SARS-CoV 3CL Protease Inhibition Assay
pH
7±n/a
Temperature
298.15±n/a K
IC50
15000±n/a nM
Citation
 Tsai, KCChen, SYLiang, PHLu, ILMahindroo, NHsieh, HPChao, YSLiu, LLiu, DLien, WLin, THWu, SY Discovery of a novel family of SARS-CoV protease inhibitors by virtual screening and 3D-QSAR studies. J Med Chem 49:3485-95 (2006)  
Target
Name:
Replicase polyprotein 1ab
Synonyms:
3C-like proteinase 3C-like proteinase (SARS-CoV 3Cpro) 3CLp GFL Guanine-N7 methyltransferase Helicase Leader protein Non-structural protein 10 Non-structural protein 3 Non-structural protein 6 Non-structural protein 8 ORF1ab polyprotein PL2-PRO Pol R1AB_SARS RdRp SARS coronavirus main proteinase nsp1 nsp12 nsp14 nsp16 nsp3 nsp5 nsp7 nsp9 pp1ab | rep
Type:
Protein
Mol. Mass.:
790250.81
Organism:
Human SARS coronavirus (SARS-CoV) (Severe acute respiratory syndrome coronavirus)
Description:
P0C6X7
Residue:
7073
  
Inhibitor
Name:
BDBM11271
Synonyms:
N-(4-chlorophenyl)-2-({4-[3-(2-chlorophenyl)-1,2-oxazol-5-yl]pyrimidin-2-yl}sulfanyl)acetamide pyrimidine-containing compound 8
Type:
Small organic molecule
Emp. Form.:
C21H14Cl2N4O2S
Mol. Mass.:
457.332
SMILES:
Clc1ccc(NC(=O)CSc2nccc(n2)-c2cc(no2)-c2ccccc2Cl)cc1
:
Substrate
Name:
fluorogenic substrate peptide
Synonyms:
Type:
Peptide
Mol. Mass.:
2662.93
Organism:
Description:
Residue:
24