Target
Phosphatidylinositol 4,5-bisphosphate 3-kinase catalytic subunit delta isoform
Ligand
BDBM320495
Substrate
Meas. Tech.
In Vitro Enzyme PI3K Assay
IC50
14.0±n/a nM
Citation
 Samby, KKSurase, YBAmale, SRGorla, SKPatel, PVerma, AK 6-morpholinyl-2-pyrazolyl-9H-purine derivatives and their use as PI3K inhibitors US Patent  US10174035 Publication Date 1/8/2019 
Target
Name:
Phosphatidylinositol 4,5-bisphosphate 3-kinase catalytic subunit delta isoform
Synonyms:
PI3-kinase p110 subunit delta PI3-kinase subunit p110-delta PIK3CD Phosphatidylinositol 4,5-biphosphate 3-kinase catalytic subunit delta (PIK3CD) Phosphatidylinositol 4,5-bisphosphate 3-kinase 110 kDa catalytic subunit delta (PI3K delta) Phosphatidylinositol 4,5-bisphosphate 3-kinase catalytic subunit delta (PI3Kdelta) Phosphatidylinositol 4,5-bisphosphate 3-kinase catalytic subunit delta isoform (PI3K delta) Phosphatidylinositol 4,5-bisphosphate 3-kinase catalytic subunit delta isoform (PI3K-delta) Phosphatidylinositol 4,5-bisphosphate 3-kinase catalytic subunit delta isoform (PI3Kdelta)
Type:
Enzyme Subunit
Mol. Mass.:
119489.41
Organism:
Homo sapiens (Human)
Description:
O00329
Residue:
1044
  
Inhibitor
Name:
BDBM320495
Synonyms:
US10174035, Compound 41 | [2-(1,3-Dimethyl-1H-pyrazol-4-yl)-6-(morpholin-4-yl)-9H-purin-8-yl][4-(morpholin-4-yl)piperidin-1-yl]methanone
Type:
Small organic molecule
Emp. Form.:
C24H33N9O3
Mol. Mass.:
495.5773
SMILES:
Cc1nn(C)cc1-c1nc(N2CCOCC2)c2nc([nH]c2n1)C(=O)N1CCC(CC1)N1CCOCC1
: