Target
cGMP-dependent 3',5'-cyclic phosphodiesterase
Ligand
BDBM320668
Substrate
Meas. Tech.
Lab B PDE2 assay
Ki
0.069±n/a nM
Citation
 Shen, DDwyer, MPSinz, CJWang, DStachel, SJPaone, DVForster, ABerger, RChen, YQian, YXu, SHu, C Dihydropyrazolopyrimidinone compounds as PDE2 inhibitors US Patent  US10174037 Publication Date 1/8/2019 
Target
Name:
cGMP-dependent 3',5'-cyclic phosphodiesterase
Synonyms:
CGS-PDE Homo sapiens phosphodiesterase 2A (PDE2A) PDE2A cGSPDE
Type:
Enzyme Catalytic Domain
Mol. Mass.:
105691.58
Organism:
Homo sapiens (Human)
Description:
O00408
Residue:
941
  
Inhibitor
Name:
BDBM320668
Synonyms:
(R)- or (S)-1-(Cyclopropyl(4- isopropylphenyl)methyl)-6- (dimethylamino)-3-(hydroxymethyl)- 1H-pyrazolo[3,4-d]pyrimidin-4(5H)- one US10174037, Example 77
Type:
Small organic molecule
Emp. Form.:
C21H27N5O2
Mol. Mass.:
381.4714
SMILES:
CC(C)c1ccc(cc1)C(C1CC1)n1nc(CO)c2c1nc([nH]c2=O)N(C)C
: