Target
Carbonic anhydrase 2
Ligand
BDBM11386
Substrate
BDBM11326
Meas. Tech.
Carbonic Anhydrase Enzyme Inhibition Assay
Ki
62±n/a nM
Citation
 Scozzafava, ASupuran, CT Carbonic anhydrase and matrix metalloproteinase inhibitors: sulfonylated amino acid hydroxamates with MMP inhibitory properties act as efficient inhibitors of CA isozymes I, II, and IV, and N-hydroxysulfonamides inhibit both these zinc enzymes. J Med Chem 43:3677-87 (2000)  
Target
Name:
Carbonic anhydrase 2
Synonyms:
CA-II CAC Carbonate dehydratase II Carbonic anhydrase 2 (CA-II) Carbonic anhydrase C Carbonic anhydrase II (CA-II) Carbonic anhydrase II (hCA II) | Carbonic anhydrase isoenzyme II (hCA II)
Type:
Enzyme
Mol. Mass.:
29250.71
Organism:
Homo sapiens (Human)
Description:
P00918
Residue:
260
  
Inhibitor
Name:
BDBM11386
Synonyms:
Hydroxysulfonamide 67 | N-hydroxy-2,4,6-trimethylbenzene-1-sulfonamide
Type:
Small organic molecule
Emp. Form.:
C9H13NO3S
Mol. Mass.:
215.269
SMILES:
Cc1cc(C)c(c(C)c1)S(=O)(=O)NO
:
Substrate
Name:
BDBM11326
Synonyms:
4-nitrophenyl acetate | p-Nitrophenyl Acetate
Type:
Small organic molecule
Emp. Form.:
C8H7NO4
Mol. Mass.:
181.1455
SMILES:
CC(=O)Oc1ccc(cc1)[N+]([O-])=O
: