Target
Interstitial collagenase
Ligand
BDBM11370
Substrate
BDBM11446
Meas. Tech.
Carbonic Anhydrase Enzyme Inhibition Assay
Ki
>100000±n/a nM
Citation
 Scozzafava, ASupuran, CT Carbonic anhydrase and matrix metalloproteinase inhibitors: sulfonylated amino acid hydroxamates with MMP inhibitory properties act as efficient inhibitors of CA isozymes I, II, and IV, and N-hydroxysulfonamides inhibit both these zinc enzymes. J Med Chem 43:3677-87 (2000)  
Target
Name:
Interstitial collagenase
Synonyms:
CLG MMP1 Matrix metalloproteinase-1 | Matrix metalloproteinase-1 (MMP-1)
Type:
Enzyme
Mol. Mass.:
54010.26
Organism:
Homo sapiens (Human)
Description:
P03956
Residue:
469
  
Inhibitor
Name:
BDBM11370
Synonyms:
(hydroxysulfamoyl)dimethylamine | Hydroxysulfonamide 51
Type:
Small organic molecule
Emp. Form.:
C2H8N2O3S
Mol. Mass.:
140.162
SMILES:
CN(C)S(=O)(=O)NO
:
Substrate
Name:
BDBM11446
Synonyms:
AcProLeuGly-S-LeuLeuGlyOEt | MMP Thioester Substrate
Type:
Emp. Form.:
Mol. Mass.:
SMILES:
: