Target
Neutrophil collagenase
Ligand
BDBM11382
Substrate
BDBM11446
Meas. Tech.
Carbonic Anhydrase Enzyme Inhibition Assay
Ki
12000±n/a nM
Citation
 Scozzafava, ASupuran, CT Carbonic anhydrase and matrix metalloproteinase inhibitors: sulfonylated amino acid hydroxamates with MMP inhibitory properties act as efficient inhibitors of CA isozymes I, II, and IV, and N-hydroxysulfonamides inhibit both these zinc enzymes. J Med Chem 43:3677-87 (2000)  
Target
Name:
Neutrophil collagenase
Synonyms:
CLG1 MMP8 Matrix metalloproteinase-8 PMNL collagenase | PMNL-CL
Type:
Enzyme
Mol. Mass.:
53413.48
Organism:
Homo sapiens (Human)
Description:
P22894
Residue:
467
  
Inhibitor
Name:
BDBM11382
Synonyms:
Hydroxysulfonamide 63 | N-[4-(hydroxysulfamoyl)phenyl]acetamide
Type:
Small organic molecule
Emp. Form.:
C8H10N2O4S
Mol. Mass.:
230.241
SMILES:
CC(=O)Nc1ccc(cc1)S(=O)(=O)NO
:
Substrate
Name:
BDBM11446
Synonyms:
AcProLeuGly-S-LeuLeuGlyOEt | MMP Thioester Substrate
Type:
Emp. Form.:
Mol. Mass.:
SMILES:
: