Target
Collagenase ColG
Ligand
BDBM11360
Substrate
BDBM11462
Meas. Tech.
Carbonic Anhydrase Enzyme Inhibition Assay
Ki
5±n/a nM
Citation
 Scozzafava, ASupuran, CT Carbonic anhydrase and matrix metalloproteinase inhibitors: sulfonylated amino acid hydroxamates with MMP inhibitory properties act as efficient inhibitors of CA isozymes I, II, and IV, and N-hydroxysulfonamides inhibit both these zinc enzymes. J Med Chem 43:3677-87 (2000)  
Target
Name:
Collagenase ColG
Synonyms:
3.4.24.3 Class I collagenase Collagenase ColG Microbial collagenase colG
Type:
Enzyme
Mol. Mass.:
126246.16
Organism:
Clostridium histolyticum
Description:
Q9S0X0
Residue:
1118
  
Inhibitor
Name:
BDBM11360
Synonyms:
Hydroxamate 41 | N-hydroxy-2-{[(4-nitrophenyl)methyl](2,3,4,5,6-pentafluorobenzene)sulfonamido}propanamide
Type:
Small organic molecule
Emp. Form.:
C16H12F5N3O6S
Mol. Mass.:
469.34
SMILES:
CC(N(Cc1ccc(cc1)N(=O)=O)S(=O)(=O)c1c(F)c(F)c(F)c(F)c1F)C(=O)NO
:
Substrate
Name:
BDBM11462
Synonyms:
Collagenase Substrate furanacryloyl-leucyl-glycyl-prolyl-alanine
Type:
Emp. Form.:
C23H32N4O7
Mol. Mass.:
476.5228
SMILES:
CC(C)C[C@H](NC(=O)\C=C\c1ccco1)C(=O)NCC(=O)N1CCC[C@H]1C(=O)N[C@@H](C)C(O)=O
: