Target
NEDD8-conjugating enzyme UBE2F
Ligand
BDBM320973
Substrate
Meas. Tech.
Nedd8 Conjugation Inhibitory Activity
IC50
27.0±n/a nM
Citation
 Mizutani, TYoshimura, CKondo, HKitade, MOhkubo, S Pyrrolopyrimidine compound or salt thereof and compositions containing the pyrrolopyrimidine compound or salt thereof US Patent  US10174040 Publication Date 1/8/2019 
Target
Name:
NEDD8-conjugating enzyme UBE2F
Synonyms:
NCE2 NEDD8 protein ligase UBE2F RING-type E3 NEDD8 transferase UBE2F UBE2F_HUMAN | Ubiquitin-conjugating enzyme E2 F
Type:
Enzyme Catalytic Domain
Mol. Mass.:
21077.76
Organism:
Homo sapiens (Human)
Description:
Q969M7
Residue:
185
  
Inhibitor
Name:
BDBM320973
Synonyms:
4-Amino-5-[2-[2,6-difluoro-4-[(3R)-3-hydroxypyrrolidin-1-yl]phenyl]ethynyl]-7-[(2R,3R,4S,5R)-3,4-dihydroxy-5-[(sulfamoylamino)methyl]tetrahydrofuran-2-yl]pyrrolo[2,3-d]pyrimidine | US10174040, Example 30
Type:
Small organic molecule
Emp. Form.:
C23H25F2N7O6S
Mol. Mass.:
565.55
SMILES:
Nc1ncnc2n(cc(C#Cc3c(F)cc(cc3F)N3CC[C@@H](O)C3)c12)[C@@H]1O[C@H](CNS(N)(=O)=O)[C@@H](O)[C@H]1O
: