Target
NEDD8-conjugating enzyme UBE2F
Ligand
BDBM321008
Substrate
Meas. Tech.
Nedd8 Conjugation Inhibitory Activity
IC50
<3.00±n/a nM
Citation
 Mizutani, TYoshimura, CKondo, HKitade, MOhkubo, S Pyrrolopyrimidine compound or salt thereof and compositions containing the pyrrolopyrimidine compound or salt thereof US Patent  US10174040 Publication Date 1/8/2019 
Target
Name:
NEDD8-conjugating enzyme UBE2F
Synonyms:
NCE2 NEDD8 protein ligase UBE2F RING-type E3 NEDD8 transferase UBE2F UBE2F_HUMAN | Ubiquitin-conjugating enzyme E2 F
Type:
Enzyme Catalytic Domain
Mol. Mass.:
21077.76
Organism:
Homo sapiens (Human)
Description:
Q969M7
Residue:
185
  
Inhibitor
Name:
BDBM321008
Synonyms:
4-Amino-7-[(2R,3R,4S,5R)-3,4-dihydroxy-5-[(sulfamoylamino)methyl]tetrahydrofuran-2-yl]-5-[2-[2-ethylsulfonyl-6-fluoro-4-[(3R)-3-fluoropyrrolidin-1-yl]phenyl]ethynyl]pyrrolo[2,3-d]pyrimidine | US10174040, Example 75
Type:
Small organic molecule
Emp. Form.:
C25H29F2N7O7S2
Mol. Mass.:
641.667
SMILES:
CCS(=O)(=O)c1cc(cc(F)c1C#Cc1cn([C@@H]2O[C@H](CNS(N)(=O)=O)[C@@H](O)[C@H]2O)c2ncnc(N)c12)N1CC[C@@H](F)C1
: