Target
NEDD8-conjugating enzyme UBE2F
Ligand
BDBM321025
Substrate
Meas. Tech.
Nedd8 Conjugation Inhibitory Activity
IC50
8.30±n/a nM
Citation
 Mizutani, TYoshimura, CKondo, HKitade, MOhkubo, S Pyrrolopyrimidine compound or salt thereof and compositions containing the pyrrolopyrimidine compound or salt thereof US Patent  US10174040 Publication Date 1/8/2019 
Target
Name:
NEDD8-conjugating enzyme UBE2F
Synonyms:
NCE2 NEDD8 protein ligase UBE2F RING-type E3 NEDD8 transferase UBE2F UBE2F_HUMAN | Ubiquitin-conjugating enzyme E2 F
Type:
Enzyme Catalytic Domain
Mol. Mass.:
21077.76
Organism:
Homo sapiens (Human)
Description:
Q969M7
Residue:
185
  
Inhibitor
Name:
BDBM321025
Synonyms:
4-Amino-7-[(1R,2S,3R,4R)-2,3-dihydroxy-4-[(sulfamoylamino)methyl]cyclopentyl]-5-[2-(2-fluoro-6-methylsulfanyl-phenyl)ethynyl]pyrrolo[2,3-d]pyrimidine US9963456, Example 98
Type:
Small organic molecule
Emp. Form.:
C21H23FN6O4S2
Mol. Mass.:
506.574
SMILES:
CSc1cccc(F)c1C#Cc1cn([C@@H]2C[C@H](CNS(N)(=O)=O)[C@@H](O)[C@H]2O)c2ncnc(N)c12
: