Target
NEDD8-conjugating enzyme UBE2F
Ligand
BDBM321027
Substrate
Meas. Tech.
Nedd8 Conjugation Inhibitory Activity
IC50
7.60±n/a nM
Citation
 Mizutani, TYoshimura, CKondo, HKitade, MOhkubo, S Pyrrolopyrimidine compound or salt thereof and compositions containing the pyrrolopyrimidine compound or salt thereof US Patent  US10174040 Publication Date 1/8/2019 
Target
Name:
NEDD8-conjugating enzyme UBE2F
Synonyms:
NCE2 NEDD8 protein ligase UBE2F RING-type E3 NEDD8 transferase UBE2F UBE2F_HUMAN | Ubiquitin-conjugating enzyme E2 F
Type:
Enzyme Catalytic Domain
Mol. Mass.:
21077.76
Organism:
Homo sapiens (Human)
Description:
Q969M7
Residue:
185
  
Inhibitor
Name:
BDBM321027
Synonyms:
4-[4-[2-[4-amino-7-[(1R,2S,3R,4R)-2,3-dihydroxy-4-[(sulfamoylamino)methyl]cyclopentyl]pyrrolo[2,3-d]pyrimidin-5-yl]ethynyl]-3,5-difluoro-phenyl]morpholine | US10174040, Example 101
Type:
Small organic molecule
Emp. Form.:
C24H27F2N7O5S
Mol. Mass.:
563.577
SMILES:
Nc1ncnc2n(cc(C#Cc3c(F)cc(cc3F)N3CCOCC3)c12)[C@@H]1C[C@H](CNS(N)(=O)=O)[C@@H](O)[C@H]1O
: