Target
Carbonic anhydrase 2
Ligand
BDBM320957
Substrate
Meas. Tech.
Carbonic Anhydrase II Enzyme Activity Inhibition
IC50
>1000±n/a nM
Citation
 Mizutani, TYoshimura, CKondo, HKitade, MOhkubo, S Pyrrolopyrimidine compound or salt thereof and compositions containing the pyrrolopyrimidine compound or salt thereof US Patent  US10174040 Publication Date 1/8/2019 
Target
Name:
Carbonic anhydrase 2
Synonyms:
CA-II CAC Carbonate dehydratase II Carbonic anhydrase 2 (CA-II) Carbonic anhydrase C Carbonic anhydrase II (CA-II) Carbonic anhydrase II (hCA II) | Carbonic anhydrase isoenzyme II (hCA II)
Type:
Enzyme
Mol. Mass.:
29250.71
Organism:
Homo sapiens (Human)
Description:
P00918
Residue:
260
  
Inhibitor
Name:
BDBM320957
Synonyms:
4-[4-Amino-7-[(2R,3R,4S,5R)-3,4-dihydroxy-5-[(sulfamoylamino)methyl]tetrahydrofuran-2-yl]pyrrolo[2,3-d]pyrimidin-5-yl]-2-(o-tolyl)thiazole US9963456, Example 2
Type:
Small organic molecule
Emp. Form.:
C21H23N7O5S2
Mol. Mass.:
517.581
SMILES:
Cc1ccccc1-c1nc(cs1)-c1cn([C@@H]2O[C@H](CNS(N)(=O)=O)[C@@H](O)[C@H]2O)c2ncnc(N)c12
: