Target
Carbonic anhydrase 2
Ligand
BDBM320970
Substrate
Meas. Tech.
Carbonic Anhydrase II Enzyme Activity Inhibition
IC50
>1000±n/a nM
Citation
 Mizutani, TYoshimura, CKondo, HKitade, MOhkubo, S Pyrrolopyrimidine compound or salt thereof and compositions containing the pyrrolopyrimidine compound or salt thereof US Patent  US10174040 Publication Date 1/8/2019 
Target
Name:
Carbonic anhydrase 2
Synonyms:
CA-II CAC Carbonate dehydratase II Carbonic anhydrase 2 (CA-II) Carbonic anhydrase C Carbonic anhydrase II (CA-II) Carbonic anhydrase II (hCA II) | Carbonic anhydrase isoenzyme II (hCA II)
Type:
Enzyme
Mol. Mass.:
29250.71
Organism:
Homo sapiens (Human)
Description:
P00918
Residue:
260
  
Inhibitor
Name:
BDBM320970
Synonyms:
4-Amino-5-[2-[2,6-difluoro-4-(methylamino)phenyl]ethynyl]-7-[(2R,3R,4S,5R)-3,4-dihydroxy-5-[(sulfamoylamino)methyl]tetrahydrofuran-2-yl]pyrrolo[2,3-d]pyrimidine US9963456, Example 25
Type:
Small organic molecule
Emp. Form.:
C20H21F2N7O5S
Mol. Mass.:
509.486
SMILES:
CNc1cc(F)c(C#Cc2cn([C@@H]3O[C@H](CNS(N)(=O)=O)[C@@H](O)[C@H]3O)c3ncnc(N)c23)c(F)c1
: