Target
AP2-associated protein kinase 1
Ligand
BDBM321078
Substrate
Meas. Tech.
AAK1 Kinase Assay
IC50
30.0±n/a nM
Citation
 Nara, SJDzierba, CDMacor, JEBronson, JJRamkumar, RMaishal, TKKaratholuvhu, MSThangavel, SThiyagarajan, K Fused pyridines as kinase inhibitors US Patent  US10174044 Publication Date 1/8/2019 
Target
Name:
AP2-associated protein kinase 1
Synonyms:
AAK1 Adaptor-associated kinase 1 | KIAA1048
Type:
PROTEIN
Mol. Mass.:
103884.23
Organism:
Homo sapiens (Human)
Description:
ChEMBL_774569
Residue:
961
  
Inhibitor
Name:
BDBM321078
Synonyms:
8-((2-amino-1,1-dideutero-2,4-dimethylpentyl)oxy)-9-chloro-5-ethyl-4-methylbenzo[c][1,7]naphthyridin-6(5H)-one | US10174044, Example 12
Type:
Small organic molecule
Emp. Form.:
C22H28ClN3O2
Mol. Mass.:
401.93
SMILES:
CCn1c2c(C)nccc2c2cc(Cl)c(OCC(C)(N)CC(C)C)cc2c1=O
: