Target
AP2-associated protein kinase 1
Ligand
BDBM321095
Substrate
Meas. Tech.
AAK1 Kinase Assay
IC50
17.0±n/a nM
Citation
 Nara, SJDzierba, CDMacor, JEBronson, JJRamkumar, RMaishal, TKKaratholuvhu, MSThangavel, SThiyagarajan, K Fused pyridines as kinase inhibitors US Patent  US10174044 Publication Date 1/8/2019 
Target
Name:
AP2-associated protein kinase 1
Synonyms:
AAK1 Adaptor-associated kinase 1 | KIAA1048
Type:
PROTEIN
Mol. Mass.:
103884.23
Organism:
Homo sapiens (Human)
Description:
ChEMBL_774569
Residue:
961
  
Inhibitor
Name:
BDBM321095
Synonyms:
(2S)-4-methyl-1-((6-methyl-6H-isochromeno[3,4-c]pyridin-8-yl)oxy)pentan-2-amine | US10174044, Example 30
Type:
Small organic molecule
Emp. Form.:
C19H24N2O2
Mol. Mass.:
312.4061
SMILES:
CC(C)C[C@H](N)COc1ccc-2c(c1)C(C)Oc1cnccc-21
: