Target
AP2-associated protein kinase 1
Ligand
BDBM321120
Substrate
Meas. Tech.
AAK1 Kinase Assay
IC50
2.10±n/a nM
Citation
 Nara, SJDzierba, CDMacor, JEBronson, JJRamkumar, RMaishal, TKKaratholuvhu, MSThangavel, SThiyagarajan, K Fused pyridines as kinase inhibitors US Patent  US10174044 Publication Date 1/8/2019 
Target
Name:
AP2-associated protein kinase 1
Synonyms:
AAK1 Adaptor-associated kinase 1 | KIAA1048
Type:
PROTEIN
Mol. Mass.:
103884.23
Organism:
Homo sapiens (Human)
Description:
ChEMBL_774569
Residue:
961
  
Inhibitor
Name:
BDBM321120
Synonyms:
(S)-isopropyl (8-((2-amino-2,4-dimethylpentyl)oxy)-6H-isochromeno[3,4-c]pyridin-2-yl)carbamate | US10174044, Example 54
Type:
Small organic molecule
Emp. Form.:
C28H39N3O6
Mol. Mass.:
513.6258
SMILES:
CC(C)C[C@@](C)(COc1ccc-2c(COc3cnc(NC(=O)OC(C)C)cc-23)c1)NC(=O)OC(C)(C)C
: