Target
AP2-associated protein kinase 1
Ligand
BDBM321127
Substrate
Meas. Tech.
AAK1 Kinase Assay
IC50
18.0±n/a nM
Citation
 Nara, SJDzierba, CDMacor, JEBronson, JJRamkumar, RMaishal, TKKaratholuvhu, MSThangavel, SThiyagarajan, K Fused pyridines as kinase inhibitors US Patent  US10174044 Publication Date 1/8/2019 
Target
Name:
AP2-associated protein kinase 1
Synonyms:
AAK1 Adaptor-associated kinase 1 | KIAA1048
Type:
PROTEIN
Mol. Mass.:
103884.23
Organism:
Homo sapiens (Human)
Description:
ChEMBL_774569
Residue:
961
  
Inhibitor
Name:
BDBM321127
Synonyms:
(S)-methyl (8-((2-amino-2,4-dimethylpentyl)oxy)-1-chloro-9-fluoro-6H-isochromeno[3,4-c]pyridin-2-yl)carbamate | US10174044, Example 58
Type:
Small organic molecule
Emp. Form.:
C21H25ClFN3O4
Mol. Mass.:
437.892
SMILES:
COC(=O)Nc1ncc2OCc3cc(OC[C@@](C)(N)CC(C)C)c(F)cc3-c2c1Cl
: