Target
Diacylglycerol O-acyltransferase 1
Ligand
BDBM321167
Substrate
Meas. Tech.
Human DGAT1LE Assay
IC50
15.8±n/a nM
Citation
 Cheung, MTangirala, RS Compounds as diacylglycerol acyltransferase inhibitors US Patent  US10174049 Publication Date 1/8/2019 
Target
Name:
Diacylglycerol O-acyltransferase 1
Synonyms:
ACAT-related gene product 1 Acyl coA-diacylglycerol acyl transferase 1 (DGAT1) DGAT1 Diacylglycerol Acyltransferase (DGAT1) Diacylglycerol O-acyltransferase 1 (DGAT1) | Diglyceride acyltransferase
Type:
Protein
Mol. Mass.:
55297.82
Organism:
Homo sapiens (Human)
Description:
O75907
Residue:
488
  
Inhibitor
Name:
BDBM321167
Synonyms:
US10174049, Example 34 US9738658, Example 34 | US9796729, 34
Type:
Small organic molecule
Emp. Form.:
C20H17N7O2
Mol. Mass.:
387.3947
SMILES:
Cc1cnc(cn1)-n1ccc2cc(ccc12)N1CCOc2ncnc(N)c2C1=O
: