Target
Isocitrate dehydrogenase [NADP] cytoplasmic [R132H]
Ligand
BDBM321235
Substrate
Meas. Tech.
Mutant IDH1 R132H Biochemical Assay
IC50
20.0±n/a nM
Citation
 Panknin, OZimmermann, KNeuhaus, R 2-aryl- and 2-arylalkyl-benzimidazoles as mIDH1 inhibitors US Patent  US10179123 Publication Date 1/15/2019 
Target
Name:
Isocitrate dehydrogenase [NADP] cytoplasmic [R132H]
Synonyms:
Cytosolic NADP-isocitrate dehydrogenase (IDH1)(R132H) IDH1 R132H IDHC_HUMAN Isocitrate dehydrogenase 1 mutant (R132H) Isocitrate dehydrogenase [NADP] cytoplasmic (IDH1)(R132H) PICD
Type:
Protein
Mol. Mass.:
46641.74
Organism:
Homo sapiens (Human)
Description:
Human IDH1 R132H (SEQ ID No. 2 in patent). First three are removed. Google patent parsed wrong.
Residue:
414
  
Inhibitor
Name:
BDBM321235
Synonyms:
US10179123, Example 2-44 | US10179123, Example 2-44-1
Type:
Small organic molecule
Emp. Form.:
C26H29F3N2O3
Mol. Mass.:
474.5153
SMILES:
C[C@H]1C[C@H](CC(C)(C)C1)n1c(Cc2ccc(OC(F)(F)F)cc2)nc2cc(C(O)=O)c(C)cc12
: