Target
Isocitrate dehydrogenase [NADP] cytoplasmic [R132H]
Ligand
BDBM321253
Substrate
Meas. Tech.
Mutant IDH1 R132H Biochemical Assay
IC50
>10000±n/a nM
Citation
 Panknin, OZimmermann, KNeuhaus, R 2-aryl- and 2-arylalkyl-benzimidazoles as mIDH1 inhibitors US Patent  US10179123 Publication Date 1/15/2019 
Target
Name:
Isocitrate dehydrogenase [NADP] cytoplasmic [R132H]
Synonyms:
Cytosolic NADP-isocitrate dehydrogenase (IDH1)(R132H) IDH1 R132H IDHC_HUMAN Isocitrate dehydrogenase 1 mutant (R132H) Isocitrate dehydrogenase [NADP] cytoplasmic (IDH1)(R132H) PICD
Type:
Protein
Mol. Mass.:
46641.74
Organism:
Homo sapiens (Human)
Description:
Human IDH1 R132H (SEQ ID No. 2 in patent). First three are removed. Google patent parsed wrong.
Residue:
414
  
Inhibitor
Name:
BDBM321253
Synonyms:
US10179123, Reference compound 2-4
Type:
Small organic molecule
Emp. Form.:
C27H31F3N2O3
Mol. Mass.:
488.5418
SMILES:
COC(=O)c1ccc2n([C@H]3C[C@@H](C)CC(C)(C)C3)c(nc2c1)C(C)c1ccc(OC(F)(F)F)cc1
: