Target
Tyrosine-protein kinase SYK
Ligand
BDBM189861
Substrate
Meas. Tech.
Time-Resolved Fluorescence (HTRF) Assay
pH
7.5±n/a
Temperature
298.15±n/a K
IC50
11.72±0.0 nM
Comments
extracted
Citation
 Miller, TAPetrocchi, ARomeo, ETVitharana, DKattar, SDNorthrup, ABAltman, MDAnthony, NJ Thiazole-substituted aminoheteroaryls as Spleen Tyrosine Kinase inhibitors US Patent  US9670196 Publication Date 6/6/2017 
Target
Name:
Tyrosine-protein kinase SYK
Synonyms:
KSYK_HUMAN Spleen Tyrosine Kinase Tyrosine-protein kinase SYK (Syk)
Type:
Enzyme
Mol. Mass.:
72079.99
Organism:
Homo sapiens (Human)
Description:
P43405
Residue:
635
  
Inhibitor
Name:
BDBM189861
Synonyms:
US9670196, 1.5 4-(1-(5-(6-(furo[3,2- b]pyridin-5-ylamino)-4- methylpyridin-2- yl)thiazol-2-yl)-1- hydroxyethyl)benzoic acid
Type:
Small organic molecule
Emp. Form.:
C25H20N4O4S
Mol. Mass.:
472.516
SMILES:
Cc1cc(Nc2ccc3occc3n2)nc(c1)-c1cnc(s1)C(C)(O)c1ccc(cc1)C(O)=O
: