Target
Sigma non-opioid intracellular receptor 1
Ligand
BDBM321263
Substrate
Meas. Tech.
Binding Assay to Sigma Receptors
Ki
20.0±n/a nM
Citation
 Melnyk, PVermersch, PCarato, POxombre-Vanteghem, BZephir, HDonnier-Marechal, M Compounds, pharmaceutical composition and their use in treating neurodegenerative diseases US Patent  US10179761 Publication Date 1/15/2019 
Target
Name:
Sigma non-opioid intracellular receptor 1
Synonyms:
Aging-associated gene 8 protein SGMR1_HUMAN SIGMAR1 SR31747-binding protein Sigma 1-type opioid receptor Sigma1R | hSigmaR1
Type:
Enzyme Catalytic Domain
Mol. Mass.:
25124.85
Organism:
Homo sapiens (Human)
Description:
Q99720
Residue:
223
  
Inhibitor
Name:
BDBM321263
Synonyms:
N-[3-(benzylmethylamino)propyl]-4-fluorobenzamide | US10179761, Compound 3.1.6
Type:
Small organic molecule
Emp. Form.:
C18H21FN2O
Mol. Mass.:
300.3705
SMILES:
CN(CCCNC(=O)c1ccc(F)cc1)Cc1ccccc1
: