Target
Sigma intracellular receptor 2
Ligand
BDBM321286
Substrate
Meas. Tech.
Binding Assay to Sigma Receptors
Ki
1400±n/a nM
Citation
 Melnyk, PVermersch, PCarato, POxombre-Vanteghem, BZephir, HDonnier-Marechal, M Compounds, pharmaceutical composition and their use in treating neurodegenerative diseases US Patent  US10179761 Publication Date 1/15/2019 
Target
Name:
Sigma intracellular receptor 2
Synonyms:
MAC30 S2R Sigma-2 receptor TMEM97 | Transmembrane protein 97
Type:
Protein
Mol. Mass.:
20857.20
Organism:
Homo sapiens (Human)
Description:
Q5BJF2
Residue:
176
  
Inhibitor
Name:
BDBM321286
Synonyms:
N-(2-(benzyl(methyl)amino)ethyl)-4-nitrobenzamide | US10179761, Compound 3.1.37
Type:
Small organic molecule
Emp. Form.:
C17H19N3O3
Mol. Mass.:
313.3511
SMILES:
CN(CCNC(=O)c1ccc(cc1)[N+]([O-])=O)Cc1ccccc1
: