Target
Sphingosine 1-phosphate receptor 5
Ligand
BDBM321299
Substrate
Meas. Tech.
In Vitro Functional Activity (Agonism) on Human S1P5 Receptors
EC50
251±n/a nM
Citation
 Stoit, AIwema Bakker, WICoolen, HKvan Dongen, MJLeflemme, NJHobson, A Spiro-cyclic amine derivatives as S1P modulators US Patent  US10179791 Publication Date 1/15/2019 
Target
Name:
Sphingosine 1-phosphate receptor 5
Synonyms:
EDG8 S1P5 S1PR5_HUMAN Sphingosine 1-phosphate receptor Edg-8
Type:
G Protein-Coupled Receptor (GPCR)
Mol. Mass.:
41796.42
Organism:
Homo sapiens (Human)
Description:
Residue:
398
  
Inhibitor
Name:
BDBM321299
Synonyms:
US10179791, Compound 51 | US10807991, Compound 51
Type:
Small organic molecule
Emp. Form.:
C24H28ClNO4
Mol. Mass.:
429.936
SMILES:
CCc1ccc(Cl)c(COc2ccc3c(OCC33CCN(CCC(O)=O)CC3)c2)c1
: