Target
Sphingosine 1-phosphate receptor 5
Ligand
BDBM321322
Substrate
Meas. Tech.
In Vitro Functional Activity (Agonism) on Human S1P5 Receptors
EC50
25.1±n/a nM
Citation
 Stoit, AIwema Bakker, WICoolen, HKvan Dongen, MJLeflemme, NJHobson, A Spiro-cyclic amine derivatives as S1P modulators US Patent  US10179791 Publication Date 1/15/2019 
Target
Name:
Sphingosine 1-phosphate receptor 5
Synonyms:
EDG8 S1P5 S1PR5_HUMAN Sphingosine 1-phosphate receptor Edg-8
Type:
G Protein-Coupled Receptor (GPCR)
Mol. Mass.:
41796.42
Organism:
Homo sapiens (Human)
Description:
Residue:
398
  
Inhibitor
Name:
BDBM321322
Synonyms:
US10179791, Compound 176 | US10807991, Compound 176
Type:
Small organic molecule
Emp. Form.:
C23H23Cl2NO3
Mol. Mass.:
432.34
SMILES:
OC(=O)CN1CCC2(COc3cc(ccc23)C2CC2c2c(Cl)cccc2Cl)CC1
: