Target
Sphingosine 1-phosphate receptor 1
Ligand
BDBM321339
Substrate
Meas. Tech.
In Vitro Functional Activity (Agonism) on Human S1P1 Receptors (Method A)
EC50
<31623±n/a nM
Citation
 Stoit, AIwema Bakker, WICoolen, HKvan Dongen, MJLeflemme, NJHobson, A Spiro-cyclic amine derivatives as S1P modulators US Patent  US10179791 Publication Date 1/15/2019 
Target
Name:
Sphingosine 1-phosphate receptor 1
Synonyms:
CHEDG1 Endothelial differentiation G-protein coupled receptor 1 S1P1 S1PR1_HUMAN Sphingosine 1-phosphate receptor Edg-1
Type:
Enzyme
Mol. Mass.:
42836.02
Organism:
Homo sapiens (Human)
Description:
P21453
Residue:
382
  
Inhibitor
Name:
BDBM321339
Synonyms:
US10179791, Compound 326 | US10807991, Compound 326
Type:
Small organic molecule
Emp. Form.:
C23H23ClF3NO4
Mol. Mass.:
469.881
SMILES:
OC(=O)CCN1CCCC2(COc3cc(OCc4c(Cl)cccc4C(F)(F)F)ccc23)C1
: