Target
Melanocortin receptor 4
Ligand
BDBM135668
Substrate
Meas. Tech.
Assay for Agonist Activity
Ki
87.0±n/a nM
Citation
 Shi, YSharma, SDDodd, JHYang, W Melanocortin receptor-specific peptides US Patent  US10179804 Publication Date 1/15/2019 
Target
Name:
Melanocortin receptor 4
Synonyms:
MC4-R MC4R_HUMAN Melanocortin receptor 4 (MC-4) Melanocortin receptor 4 (MC4R)
Type:
Enzyme
Mol. Mass.:
36949.50
Organism:
Homo sapiens (Human)
Description:
P32245
Residue:
332
  
Inhibitor
Name:
BDBM135668
Synonyms:
US10179804, Example 115 US8846601, 53
Type:
Small organic molecule
Emp. Form.:
C50H69N17O10
Mol. Mass.:
1068.1908
SMILES:
CC(=O)N[C@@H](CCCNC(N)=N)C(=O)N[C@H]1CC(=O)NCCCC[C@H](NC(=O)[C@H](Cc2c[nH]c3ccccc23)NC(=O)[C@H](CCCNC(N)=O)NC(=O)[C@@H](Cc2ccccc2)NC(=O)[C@H](Cc2c[nH]cn2)NC1=O)C(N)=O
: