Target
Melanocortin receptor 4
Ligand
BDBM321440
Substrate
Meas. Tech.
Assay for Agonist Activity
Ki
3.00±n/a nM
Citation
 Shi, YSharma, SDDodd, JHYang, W Melanocortin receptor-specific peptides US Patent  US10179804 Publication Date 1/15/2019 
Target
Name:
Melanocortin receptor 4
Synonyms:
MC4-R MC4R_HUMAN Melanocortin receptor 4 (MC-4) Melanocortin receptor 4 (MC4R)
Type:
Enzyme
Mol. Mass.:
36949.50
Organism:
Homo sapiens (Human)
Description:
P32245
Residue:
332
  
Inhibitor
Name:
BDBM321440
Synonyms:
Ac-Arg-cyclo(Asp-Dab- D-Phe-Arg-Trp-Lys)- NH-cyclopropyl | US10179804, Example 122
Type:
Small organic molecule
Emp. Form.:
C52H76N16O9
Mol. Mass.:
1069.2616
SMILES:
CC(=O)N[C@@H](CCCNC(N)=N)C(=O)N[C@H]1CC(=O)CCCCC[C@H](NC(=O)[C@H](Cc2c[nH]c3ccccc23)NC(=O)[C@H](CCCNC(N)=N)NC(=O)[C@@H](Cc2ccccc2)NC(=O)[C@H](CCN)NC1=O)C(=O)NC1CC1
: