Target
Melanocortin receptor 4
Ligand
BDBM253654
Substrate
Meas. Tech.
Assay for Agonist Activity
Ki
30.0±n/a nM
Citation
 Shi, YSharma, SDDodd, JHYang, W Melanocortin receptor-specific peptides US Patent  US10179804 Publication Date 1/15/2019 
Target
Name:
Melanocortin receptor 4
Synonyms:
MC4-R MC4R_HUMAN Melanocortin receptor 4 (MC-4) Melanocortin receptor 4 (MC4R)
Type:
Enzyme
Mol. Mass.:
36949.50
Organism:
Homo sapiens (Human)
Description:
P32245
Residue:
332
  
Inhibitor
Name:
BDBM253654
Synonyms:
US10179804, Example 134 US9458201, 134
Type:
Small organic molecule
Emp. Form.:
C52H71N15O10
Mol. Mass.:
1066.2146
SMILES:
N[C@@H](CCCNC(N)=N)C(=O)N[C@H]1CC(=O)NCCCC[C@H](NC(=O)[C@H](Cc2c[nH]c3ccccc23)NC(=O)[C@H](CCCNC(N)=N)NC(=O)[C@@H](Cc2ccccc2)NC(=O)[C@H](COCc2ccccc2)NC1=O)C(O)=O
: