Target
Bromodomain-containing protein 4 [42-168]
Ligand
BDBM321344
Substrate
Meas. Tech.
IC50 Measurements for Inhibitors Using BRD4 AlphaLisa Binding Assay
IC50
2700±n/a nM
Citation
 Albrecht, BKBellon, SFBurdick, DJCote, ACrawford, TDakin, LAHsiao-Wei Tsui, VHewitt, MCLeBlanc, YMagnuson, SRNasveschuk, CGRomero, FATang, YTaylor, AMWang, S Therapeutic compounds and uses thereof US Patent  US10183009 Publication Date 1/22/2019 
Target
Name:
Bromodomain-containing protein 4 [42-168]
Synonyms:
BRD4 BRD4_HUMAN HUNK1
Type:
Enzyme Catalytic Domain
Mol. Mass.:
15054.68
Organism:
Homo sapiens (Human)
Description:
O60885[42-168]
Residue:
127
  
Inhibitor
Name:
BDBM321344
Synonyms:
N,N-dimethyl-3-[7-oxo-6-[(E)-pent-2-enyl]-1H-pyrrolo[2,3-c]pyridin-4-yl]benzamide | US10183009, Example 7
Type:
Small organic molecule
Emp. Form.:
C21H23N3O2
Mol. Mass.:
349.4262
SMILES:
CC\C=C\Cn1cc(-c2cccc(c2)C(=O)N(C)C)c2cc[nH]c2c1=O
: